{"text_format":"1","workbook":"xlsx","n_sheets":7,"sheets":["Home","ThinkingWise 1","ThinkingWise 2","Master Lists","Max4 - Risks","CAS - Risks","MAC - Risks"],"not_rendered":{"charts":0,"images":7,"macros":1,"external_links":0,"defined_names":0,"comments":5,"pivot_tables":0},"unopened":[],"bounds":{"document_bytes":16777216,"sheet_cells":100000,"rows_first":2000,"rows_last":500,"rows_between":2000,"halvings":0,"cell_chars":16384,"cell_head_chars":4096},"cells_cut":0,"cells_raw":0,"read":"whole","date_system":"1900"}

{"sheet":"Home","index":0,"n_rows":18,"n_cols":3,"rows_kept":18,"cut":false,"hidden":false,"merged":[]}
[]
[null,null,"PriorityWise One"]
[null,null,"PriorityWise  Two"]
[]
[null,null,"ThinkingWise One"]
[null,null,"ThinkingWise Two"]
[]
[null,null,"CauseWise Statement"]
[null,null,"CauseWise - Intuitive Detail"]
[null,null,"CauseWise - Analytical Detail"]
[null,null,"CauseWise - Causes and Confirmation"]
[]
[null,null,"SolutionWise Requirements"]
[null,null,"SolutionWise - Maxfour"]
[null,null,"SolutionWise - Create a Solution"]
[null,null,"SolutionWise - Making a Choice"]
[]
[null,null,"RiskWise"]

{"sheet":"ThinkingWise 1","index":1,"n_rows":59,"n_cols":11,"rows_kept":59,"cut":false,"hidden":false,"merged":[[17,2,17,3],[17,5,17,6],[18,2,18,3],[18,5,18,6],[19,2,19,3],[19,5,19,6],[23,2,23,3],[23,5,23,6],[20,2,20,3],[20,5,20,6],[21,2,21,3],[21,5,21,6],[22,2,22,3],[22,5,22,6],[9,2,9,3],[9,5,9,6],[6,9,6,10],[6,2,6,7],[16,5,16,6],[11,2,11,3],[12,2,12,3],[13,2,13,3],[10,2,10,3],[10,5,10,6],[14,2,14,3],[28,5,28,6],[37,2,37,3],[37,5,37,6],[41,2,41,3],[41,5,41,6],[24,2,24,3],[24,5,24,6],[38,2,38,3],[38,5,38,6],[25,2,25,3],[25,5,25,6],[29,2,29,3],[30,2,30,3],[31,2,31,3],[32,2,32,3],[33,2,33,3],[34,2,34,3],[29,5,29,6],[30,5,30,6],[26,2,26,3],[26,5,26,6],[27,2,27,3],[27,5,27,6],[28,2,28,3],[44,2,44,3],[44,5,44,6],[45,2,45,3],[45,5,45,6],[46,2,46,3],[46,5,46,6],[43,2,43,3],[43,5,43,6],[31,5,31,6],[32,5,32,6],[33,5,33,6],[34,5,34,6],[35,5,35,6],[40,5,40,6],[39,2,39,3],[39,5,39,6],[40,2,40,3],[35,2,35,3],[36,2,36,3],[36,5,36,6],[42,2,42,3],[42,5,42,6],[50,2,50,3],[50,5,50,6],[51,2,51,3],[51,5,51,6],[52,2,52,3],[52,5,52,6],[47,2,47,3],[47,5,47,6],[48,2,48,3],[48,5,48,6],[49,2,49,3],[49,5,49,6],[56,2,56,3],[56,5,56,6],[57,2,57,3],[57,5,57,6],[58,2,58,3],[58,5,58,6],[53,2,53,3],[53,5,53,6],[54,2,54,3],[54,5,54,6],[55,2,55,3],[55,5,55,6],[63,5,63,6],[64,2,64,3],[64,5,64,6],[59,2,59,3],[59,5,59,6],[60,2,60,3],[60,5,60,6],[61,2,61,3],[61,5,61,6],[0,2,0,10],[74,2,74,3],[74,5,74,6],[71,2,71,3],[71,5,71,6],[72,2,72,3],[72,5,72,6],[73,2,73,3],[73,5,73,6],[68,2,68,3],[68,5,68,6],[69,2,69,3],[69,5,69,6],[70,2,70,3],[70,5,70,6],[65,2,65,3],[65,5,65,6],[66,2,66,3],[66,5,66,6],[67,2,67,3],[67,5,67,6],[62,2,62,3],[62,5,62,6],[63,2,63,3],[3,3,4,7],[3,8,4,10],[8,10,9,10],[10,10,11,10],[12,10,13,10],[14,10,15,10],[16,10,17,10],[8,9,9,9],[10,9,11,9],[12,9,13,9],[14,9,15,9],[16,9,17,9],[15,2,15,3],[16,2,16,3],[11,5,11,6],[12,5,12,6],[13,5,13,6],[14,5,14,6],[15,5,15,6],[7,2,7,3],[7,5,7,6],[3,2,4,2],[8,2,8,3],[8,5,8,6]]}
["HOME",null,"ThinkingWise 1"]
[]
["NEXT"]
[null,null,"1. State the Problem"]
[]
[]
[null,null,"2. Clarify the Information – Components: List Factors and Stakeholders",null,null,null,null,null,null,"3. Crystilize Core Issues"]
[null,null,"Factor / Stakeholder -",null,"√","Factor / Stakeholder -",null,"√",null,null,"What is core, when resolved would resolve many other issues?"]
[null,null,null,null,null,null,null,null,null,1,"Core Issue 1"]
[]
[null,null,null,null,null,null,null,null,null,2,"Core Issue 2"]
[]
[null,null,null,null,null,null,null,null,null,3,"Core Issue 3"]
[]
[null,null,null,null,null,null,null,null,null,4,"Core Issue 4"]
[]
[null,null,null,null,null,null,null,null,null,5,"Core Issue 5"]
[]
[]
[]
[]
[]
[]
[]
[null,null,"Factor / Stakeholder -",null,"√","Factor / Stakeholder -",null,"√",null,null,"Copyright © 1998-2016 Thinking Dimensions Global. All rights Reserved."]
[]
[]
[]
[]
[]
[]
[]
[]
[]
[]
[]
[]
[]
[]
[]
[]
[null,null,"Factor / Stakeholder -",null,"√","Factor / Stakeholder -",null,"√"]
[]
[]
[]
[]
[]
[]
[]
[]
[]
[]
[]
[]
[]
[]
[]
[]
[null,null,"Factor / Stakeholder -",null,"√","Factor / Stakeholder -",null,"√"]

{"sheet":"ThinkingWise 2","index":2,"n_rows":23,"n_cols":10,"rows_kept":23,"cut":false,"hidden":false,"merged":[[11,3,11,4],[12,3,12,4],[13,3,13,4],[14,3,14,4],[15,3,15,4],[0,2,0,9],[9,2,9,4],[10,2,10,4],[2,2,2,4],[3,3,3,9],[4,3,4,9],[5,3,5,9],[6,3,6,9],[7,3,7,9],[22,7,22,8],[20,3,20,4],[16,3,16,4],[17,3,17,4],[18,3,18,4],[19,3,19,4]]}
["HOME",null,"ThinkingWise 2"]
[]
[null,null,"3a. Crystallize Core Issues"]
["BACK",null,{"$f":"IF('ThinkingWise 1'!J9>0,'ThinkingWise 1'!J9,\"\")","v":1},{"$f":"IF('ThinkingWise 1'!K9>0,'ThinkingWise 1'!K9,\"\")","v":"Core Issue 1"}]
[null,null,2,{"$f":"IF('ThinkingWise 1'!K11>0,'ThinkingWise 1'!K11,\"\")","v":"Core Issue 2"}]
[null,null,3,{"$f":"IF('ThinkingWise 1'!K13>0,'ThinkingWise 1'!K13,\"\")","v":"Core Issue 3"}]
[null,null,4,{"$f":"IF('ThinkingWise 1'!K15>0,'ThinkingWise 1'!K15,\"\")","v":"Core Issue 4"}]
[null,null,5,{"$f":"IF('ThinkingWise 1'!K17>0,'ThinkingWise 1'!K17,\"\")","v":"Core Issue 5"}]
[]
[null,null,"4. Refocusing the Problem / Next Steps"]
[null,null,"Actions to be taken",null,null,"Responsible","Target Date","Identify Risks","Likely Reasons for Risks","Identify Avoiding Actions"]
[null,null,1]
[null,null,2]
[null,null,3]
[null,null,4]
[null,null,5]
[null,null,6]
[null,null,7]
[null,null,8]
[null,null,9]
[null,null,10]
[]
[null,null,null,null,null,null,null,"Copyright © 1998-2016 Thinking Dimensions Global. All rights Reserved."]

{"sheet":"Master Lists","index":3,"n_rows":28,"n_cols":9,"rows_kept":28,"cut":false,"hidden":true,"merged":[]}
["PRIORITYWISE LISTS",null,"THINKINGWISE LISTS",null,"SOLUTIONWISE LISTS",null,"CAUSEWISE LISTS",null,"RISKWISE LISTS"]
[]
["High",null,"√",null,3,null,"YES",null,"H"]
["Medium",null,"½",null,2,null,"NO",null,"M"]
["Low",null,null,null,1,null,"A",null,"L"]
[null,null,null,null,0]
["Cause "]
["Effect",null,null,null,1]
[null,null,null,null,2]
["Core Issue",null,null,null,3]
[null,null,null,null,4]
[null,null,null,null,5]
[null,null,null,null,6]
["Home",null,null,null,7]
[null,null,null,null,8]
[null,null,null,null,9]
[null,null,null,null,10]
[]
[null,null,null,null,"YES"]
[null,null,null,null,"NO"]
[null,null,null,null,"N/A"]
[]
[null,null,null,null,"√"]
[null,null,null,null,"½"]
[]
[null,null,null,null,"Min. Req."]
[]
[null,null,null,null,"Best Alternative"]

{"sheet":"Max4 - Risks","index":4,"n_rows":37,"n_cols":6,"rows_kept":37,"cut":false,"hidden":true,"merged":[[4,2,4,3],[5,2,5,3],[6,2,6,3],[26,2,27,2],[26,3,27,4],[17,3,17,4],[24,2,25,2],[24,3,25,4],[0,2,0,5],[14,2,14,3],[15,2,15,3],[8,2,8,3],[26,5,27,5],[9,2,9,3],[10,2,10,3],[11,2,11,3],[12,2,12,3],[13,2,13,3],[7,2,7,3],[2,2,2,3],[3,2,3,3],[22,2,23,2],[22,3,23,4],[22,5,23,5],[24,5,25,5],[18,2,19,2],[18,3,19,4],[18,5,19,5],[20,2,21,2],[20,3,21,4],[20,5,21,5],[28,2,29,2],[28,3,29,4],[28,5,29,5],[30,2,31,2],[30,3,31,4],[30,5,31,5],[36,2,37,2],[36,3,37,4],[36,5,37,5],[32,2,33,2],[32,3,33,4],[32,5,33,5],[34,2,35,2],[34,3,35,4],[34,5,35,5]]}
["HOME",null,"Max4 - Assessing Risks"]
[]
["NEXT",null,"Action Plan"]
["BACK",null,"Action Steps",null,"Who would be responsible","When/Target Date"]
[null,null,{"$f":"IF(#REF!<>\"\",#REF!,\"\")","v":{"$error":"#REF!"}},null,{"$f":"IF(#REF!<>\"\",#REF!,\"\")","v":{"$error":"#REF!"}},{"$f":"IF(#REF!<>\"\",#REF!,\"\")","v":{"$error":"#REF!"}}]
[null,null,{"$f":"IF(#REF!<>\"\",#REF!,\"\")","v":{"$error":"#REF!"}},null,{"$f":"IF(#REF!<>\"\",#REF!,\"\")","v":{"$error":"#REF!"}},{"$f":"IF(#REF!<>\"\",#REF!,\"\")","v":{"$error":"#REF!"}}]
[null,null,{"$f":"IF(#REF!<>\"\",#REF!,\"\")","v":{"$error":"#REF!"}},null,{"$f":"IF(#REF!<>\"\",#REF!,\"\")","v":{"$error":"#REF!"}},{"$f":"IF(#REF!<>\"\",#REF!,\"\")","v":{"$error":"#REF!"}}]
[null,null,{"$f":"IF(#REF!<>\"\",#REF!,\"\")","v":{"$error":"#REF!"}},null,{"$f":"IF(#REF!<>\"\",#REF!,\"\")","v":{"$error":"#REF!"}},{"$f":"IF(#REF!<>\"\",#REF!,\"\")","v":{"$error":"#REF!"}}]
[null,null,{"$f":"IF(#REF!<>\"\",#REF!,\"\")","v":{"$error":"#REF!"}},null,{"$f":"IF(#REF!<>\"\",#REF!,\"\")","v":{"$error":"#REF!"}},{"$f":"IF(#REF!<>\"\",#REF!,\"\")","v":{"$error":"#REF!"}}]
[null,null,{"$f":"IF(#REF!<>\"\",#REF!,\"\")","v":{"$error":"#REF!"}},null,{"$f":"IF(#REF!<>\"\",#REF!,\"\")","v":{"$error":"#REF!"}},{"$f":"IF(#REF!<>\"\",#REF!,\"\")","v":{"$error":"#REF!"}}]
[null,null,{"$f":"IF(#REF!<>\"\",#REF!,\"\")","v":{"$error":"#REF!"}},null,{"$f":"IF(#REF!<>\"\",#REF!,\"\")","v":{"$error":"#REF!"}},{"$f":"IF(#REF!<>\"\",#REF!,\"\")","v":{"$error":"#REF!"}}]
[null,null,{"$f":"IF(#REF!<>\"\",#REF!,\"\")","v":{"$error":"#REF!"}},null,{"$f":"IF(#REF!<>\"\",#REF!,\"\")","v":{"$error":"#REF!"}},{"$f":"IF(#REF!<>\"\",#REF!,\"\")","v":{"$error":"#REF!"}}]
[null,null,{"$f":"IF(#REF!<>\"\",#REF!,\"\")","v":{"$error":"#REF!"}},null,{"$f":"IF(#REF!<>\"\",#REF!,\"\")","v":{"$error":"#REF!"}},{"$f":"IF(#REF!<>\"\",#REF!,\"\")","v":{"$error":"#REF!"}}]
[null,null,{"$f":"IF(#REF!<>\"\",#REF!,\"\")","v":{"$error":"#REF!"}},null,{"$f":"IF(#REF!<>\"\",#REF!,\"\")","v":{"$error":"#REF!"}},{"$f":"IF(#REF!<>\"\",#REF!,\"\")","v":{"$error":"#REF!"}}]
[null,null,{"$f":"IF(#REF!<>\"\",#REF!,\"\")","v":{"$error":"#REF!"}},null,{"$f":"IF(#REF!<>\"\",#REF!,\"\")","v":{"$error":"#REF!"}},{"$f":"IF(#REF!<>\"\",#REF!,\"\")","v":{"$error":"#REF!"}}]
[null,null,{"$f":"IF(#REF!<>\"\",#REF!,\"\")","v":{"$error":"#REF!"}},null,{"$f":"IF(#REF!<>\"\",#REF!,\"\")","v":{"$error":"#REF!"}},{"$f":"IF(#REF!<>\"\",#REF!,\"\")","v":{"$error":"#REF!"}}]
[]
[null,null,"List Risks","List Likely Reasons",null,"Identify Avoiding Actions"]
[null,null," "]
[]
[null,null," "]
[]
[null,null," "]
[]
[null,null," "]
[]
[null,null," "]
[]
[null,null," "]
[]
[null,null," "]
[]
[null,null," "]
[]
[null,null," "]
[]
[null,null," "]

{"sheet":"CAS - Risks","index":5,"n_rows":37,"n_cols":6,"rows_kept":37,"cut":false,"hidden":true,"merged":[[6,2,6,3],[0,2,0,5],[2,2,2,3],[3,2,3,3],[4,2,4,3],[5,2,5,3],[1,2,1,5],[12,2,12,3],[13,2,13,3],[14,2,14,3],[15,2,15,3],[17,3,17,4],[7,2,7,3],[8,2,8,3],[9,2,9,3],[10,2,10,3],[11,2,11,3],[18,5,19,5],[20,2,21,2],[20,3,21,4],[20,5,21,5],[22,2,23,2],[22,3,23,4],[22,5,23,5],[18,2,19,2],[18,3,19,4],[24,5,25,5],[26,2,27,2],[26,3,27,4],[26,5,27,5],[28,2,29,2],[28,3,29,4],[28,5,29,5],[24,2,25,2],[24,3,25,4],[30,2,31,2],[30,3,31,4],[30,5,31,5],[32,2,33,2],[32,3,33,4],[32,5,33,5],[34,2,35,2],[34,3,35,4],[34,5,35,5],[36,2,37,2],[36,3,37,4],[36,5,37,5]]}
["HOME",null,"Create a Solution - Assessing Risks"]
[]
["NEXT",null,"Action Plan"]
["BACK",null,"Action Steps",null,"Who would be responsible","When/Target Date"]
[null,null,{"$f":"IF(#REF!<>\"\",#REF!,\"\")","v":{"$error":"#REF!"}},null,{"$f":"IF(#REF!<>\"\",#REF!,\"\")","v":{"$error":"#REF!"}},{"$f":"IF(#REF!<>\"\",#REF!,\"\")","v":{"$error":"#REF!"}}]
[null,null,{"$f":"IF(#REF!<>\"\",#REF!,\"\")","v":{"$error":"#REF!"}},null,{"$f":"IF(#REF!<>\"\",#REF!,\"\")","v":{"$error":"#REF!"}},{"$f":"IF(#REF!<>\"\",#REF!,\"\")","v":{"$error":"#REF!"}}]
[null,null,{"$f":"IF(#REF!<>\"\",#REF!,\"\")","v":{"$error":"#REF!"}},null,{"$f":"IF(#REF!<>\"\",#REF!,\"\")","v":{"$error":"#REF!"}},{"$f":"IF(#REF!<>\"\",#REF!,\"\")","v":{"$error":"#REF!"}}]
[null,null,{"$f":"IF(#REF!<>\"\",#REF!,\"\")","v":{"$error":"#REF!"}},null,{"$f":"IF(#REF!<>\"\",#REF!,\"\")","v":{"$error":"#REF!"}},{"$f":"IF(#REF!<>\"\",#REF!,\"\")","v":{"$error":"#REF!"}}]
[null,null,{"$f":"IF(#REF!<>\"\",#REF!,\"\")","v":{"$error":"#REF!"}},null,{"$f":"IF(#REF!<>\"\",#REF!,\"\")","v":{"$error":"#REF!"}},{"$f":"IF(#REF!<>\"\",#REF!,\"\")","v":{"$error":"#REF!"}}]
[null,null,{"$f":"IF(#REF!<>\"\",#REF!,\"\")","v":{"$error":"#REF!"}},null,{"$f":"IF(#REF!<>\"\",#REF!,\"\")","v":{"$error":"#REF!"}},{"$f":"IF(#REF!<>\"\",#REF!,\"\")","v":{"$error":"#REF!"}}]
[null,null,{"$f":"IF(#REF!<>\"\",#REF!,\"\")","v":{"$error":"#REF!"}},null,{"$f":"IF(#REF!<>\"\",#REF!,\"\")","v":{"$error":"#REF!"}},{"$f":"IF(#REF!<>\"\",#REF!,\"\")","v":{"$error":"#REF!"}}]
[null,null,{"$f":"IF(#REF!<>\"\",#REF!,\"\")","v":{"$error":"#REF!"}},null,{"$f":"IF(#REF!<>\"\",#REF!,\"\")","v":{"$error":"#REF!"}},{"$f":"IF(#REF!<>\"\",#REF!,\"\")","v":{"$error":"#REF!"}}]
[null,null,{"$f":"IF(#REF!<>\"\",#REF!,\"\")","v":{"$error":"#REF!"}},null,{"$f":"IF(#REF!<>\"\",#REF!,\"\")","v":{"$error":"#REF!"}},{"$f":"IF(#REF!<>\"\",#REF!,\"\")","v":{"$error":"#REF!"}}]
[null,null,{"$f":"IF(#REF!<>\"\",#REF!,\"\")","v":{"$error":"#REF!"}},null,{"$f":"IF(#REF!<>\"\",#REF!,\"\")","v":{"$error":"#REF!"}},{"$f":"IF(#REF!<>\"\",#REF!,\"\")","v":{"$error":"#REF!"}}]
[null,null,{"$f":"IF(#REF!<>\"\",#REF!,\"\")","v":{"$error":"#REF!"}},null,{"$f":"IF(#REF!<>\"\",#REF!,\"\")","v":{"$error":"#REF!"}},{"$f":"IF(#REF!<>\"\",#REF!,\"\")","v":{"$error":"#REF!"}}]
[null,null,{"$f":"IF(#REF!<>\"\",#REF!,\"\")","v":{"$error":"#REF!"}},null,{"$f":"IF(#REF!<>\"\",#REF!,\"\")","v":{"$error":"#REF!"}},{"$f":"IF(#REF!<>\"\",#REF!,\"\")","v":{"$error":"#REF!"}}]
[]
[null,null,"List Risks","List Likely Reasons",null,"Identify Avoiding Actions"]
[null,null," "]
[]
[null,null," "]
[]
[null,null," "]
[]
[null,null," "]
[]
[null,null," "]
[]
[null,null," "]
[]
[null,null," "]
[]
[null,null," "]
[]
[null,null," "]
[]
[null,null," "]

{"sheet":"MAC - Risks","index":6,"n_rows":39,"n_cols":6,"rows_kept":39,"cut":false,"hidden":true,"merged":[[6,2,6,3],[0,2,0,5],[2,2,2,3],[3,2,3,3],[4,2,4,3],[5,2,5,3],[12,2,12,3],[13,2,13,3],[14,2,14,3],[15,2,15,3],[17,3,17,4],[7,2,7,3],[8,2,8,3],[9,2,9,3],[10,2,10,3],[11,2,11,3],[18,5,19,5],[20,2,21,2],[20,3,21,4],[20,5,21,5],[22,2,23,2],[22,3,23,4],[22,5,23,5],[18,2,19,2],[18,3,19,4],[24,5,25,5],[26,2,27,2],[26,3,27,4],[26,5,27,5],[28,2,29,2],[28,3,29,4],[28,5,29,5],[24,2,25,2],[24,3,25,4],[34,2,35,2],[34,3,35,4],[34,5,35,5],[36,2,37,2],[36,3,37,4],[36,5,37,5],[30,2,31,2],[30,3,31,4],[30,5,31,5],[32,2,33,2],[32,3,33,4],[32,5,33,5]]}
["HOME",null,"Making a Choice - Assessing Risks"]
[]
[null,null,"Action Plan"]
["BACK",null,"Action Steps",null,"Who would be responsible","When/Target Date"]
[null,null,{"$f":"IF(#REF!<>\"\",#REF!,\"\")","v":{"$error":"#REF!"}},null,{"$f":"IF(#REF!<>\"\",#REF!,\"\")","v":{"$error":"#REF!"}},{"$f":"IF(#REF!<>\"\",#REF!,\"\")","v":{"$error":"#REF!"}}]
[null,null,{"$f":"IF(#REF!<>\"\",#REF!,\"\")","v":{"$error":"#REF!"}},null,{"$f":"IF(#REF!<>\"\",#REF!,\"\")","v":{"$error":"#REF!"}},{"$f":"IF(#REF!<>\"\",#REF!,\"\")","v":{"$error":"#REF!"}}]
[null,null,{"$f":"IF(#REF!<>\"\",#REF!,\"\")","v":{"$error":"#REF!"}},null,{"$f":"IF(#REF!<>\"\",#REF!,\"\")","v":{"$error":"#REF!"}},{"$f":"IF(#REF!<>\"\",#REF!,\"\")","v":{"$error":"#REF!"}}]
[null,null,{"$f":"IF(#REF!<>\"\",#REF!,\"\")","v":{"$error":"#REF!"}},null,{"$f":"IF(#REF!<>\"\",#REF!,\"\")","v":{"$error":"#REF!"}},{"$f":"IF(#REF!<>\"\",#REF!,\"\")","v":{"$error":"#REF!"}}]
[null,null,{"$f":"IF(#REF!<>\"\",#REF!,\"\")","v":{"$error":"#REF!"}},null,{"$f":"IF(#REF!<>\"\",#REF!,\"\")","v":{"$error":"#REF!"}},{"$f":"IF(#REF!<>\"\",#REF!,\"\")","v":{"$error":"#REF!"}}]
[null,null,{"$f":"IF(#REF!<>\"\",#REF!,\"\")","v":{"$error":"#REF!"}},null,{"$f":"IF(#REF!<>\"\",#REF!,\"\")","v":{"$error":"#REF!"}},{"$f":"IF(#REF!<>\"\",#REF!,\"\")","v":{"$error":"#REF!"}}]
[null,null,{"$f":"IF(#REF!<>\"\",#REF!,\"\")","v":{"$error":"#REF!"}},null,{"$f":"IF(#REF!<>\"\",#REF!,\"\")","v":{"$error":"#REF!"}},{"$f":"IF(#REF!<>\"\",#REF!,\"\")","v":{"$error":"#REF!"}}]
[null,null,{"$f":"IF(#REF!<>\"\",#REF!,\"\")","v":{"$error":"#REF!"}},null,{"$f":"IF(#REF!<>\"\",#REF!,\"\")","v":{"$error":"#REF!"}},{"$f":"IF(#REF!<>\"\",#REF!,\"\")","v":{"$error":"#REF!"}}]
[null,null,{"$f":"IF(#REF!<>\"\",#REF!,\"\")","v":{"$error":"#REF!"}},null,{"$f":"IF(#REF!<>\"\",#REF!,\"\")","v":{"$error":"#REF!"}},{"$f":"IF(#REF!<>\"\",#REF!,\"\")","v":{"$error":"#REF!"}}]
[null,null,{"$f":"IF(#REF!<>\"\",#REF!,\"\")","v":{"$error":"#REF!"}},null,{"$f":"IF(#REF!<>\"\",#REF!,\"\")","v":{"$error":"#REF!"}},{"$f":"IF(#REF!<>\"\",#REF!,\"\")","v":{"$error":"#REF!"}}]
[null,null,{"$f":"IF(#REF!<>\"\",#REF!,\"\")","v":{"$error":"#REF!"}},null,{"$f":"IF(#REF!<>\"\",#REF!,\"\")","v":{"$error":"#REF!"}},{"$f":"IF(#REF!<>\"\",#REF!,\"\")","v":{"$error":"#REF!"}}]
[null,null,{"$f":"IF(#REF!<>\"\",#REF!,\"\")","v":{"$error":"#REF!"}},null,{"$f":"IF(#REF!<>\"\",#REF!,\"\")","v":{"$error":"#REF!"}},{"$f":"IF(#REF!<>\"\",#REF!,\"\")","v":{"$error":"#REF!"}}]
[]
[null,null,"List Risks","List Likely Reasons",null,"Identify Avoiding Actions"]
[null,null," "]
[]
[null,null," "]
[]
[]
[]
[null,null," "]
[]
[null,null," "]
[]
[null,null," "]
[]
[null,null," "]
[]
[null,null," "]
[]
[null,null," "]
[]
[null,null," "]
[]
[null,null," "]