{"text_format":"1","workbook":"xlsx","n_sheets":3,"sheets":["PriorityWise1","PriorityWise 2","Master Lists"],"not_rendered":{"charts":0,"images":6,"macros":1,"external_links":0,"defined_names":0,"comments":0,"pivot_tables":0},"unopened":[],"bounds":{"document_bytes":16777216,"sheet_cells":100000,"rows_first":2000,"rows_last":500,"rows_between":2000,"halvings":0,"cell_chars":16384,"cell_head_chars":4096},"cells_cut":0,"cells_raw":0,"read":"whole","date_system":"1900"}

{"sheet":"PriorityWise1","index":0,"n_rows":37,"n_cols":7,"rows_kept":37,"cut":false,"hidden":false,"merged":[[33,2,33,3],[34,2,34,3],[35,2,35,3],[36,2,36,3],[0,2,0,6],[27,2,27,3],[28,2,28,3],[29,2,29,3],[30,2,30,3],[31,2,31,3],[32,2,32,3],[21,2,21,3],[22,2,22,3],[23,2,23,3],[24,2,24,3],[25,2,25,3],[26,2,26,3],[15,2,15,3],[16,2,16,3],[17,2,17,3],[18,2,18,3],[19,2,19,3],[20,2,20,3],[14,2,14,3],[13,5,13,6],[7,5,7,6],[8,2,8,3],[8,5,8,6],[9,2,9,3],[9,5,9,6],[10,2,10,3],[10,5,10,6],[11,2,11,3],[11,5,11,6],[12,2,12,3],[13,2,13,3],[2,3,5,3],[3,5,3,6],[4,5,4,6],[5,5,5,6],[6,5,6,6]]}
["HOME",null,"PriorityWise 1"]
[]
["NEXT",null,"1. State the Situation","Shared situation text.",null,"2a. List the Stakeholders"]
[null,null,null,null,null,"Who would be affected by this situation or who could influence this situation?"]
[null,null,null,null,null,"Stakeholder #1"]
[]
[]
[null,null,"2b. List Issues and Challenges"]
[null,null,"Issue #1"]
[null,null,"Issue #2"]
[null,null,"Issue #3"]
[null,null,"Issue #4"]
[null,null,"Issue #5"]
[null,null,"Issue #6",null,null,"3a. Select Criteria"]
[null,null,"Issue #7",null,null,"Criteria 1","Add 1 here"]
[null,null,"Issue #8",null,null,"Criteria 2","Add 2 here"]
[null,null,"Issue #9",null,null,"Criteria 3","Add 3 here"]
[null,null,"Issue #10",null,null,"Criteria 4","Add 4 here"]
[null,null,"Issue #11",null,null,"Criteria 5","Add 5 here"]
[null,null,"Issue #12"]
[null,null,"Issue #13"]
[null,null,"Issue #14"]
[null,null,"Issue #15"]
[null,null,"Issue #16"]
[null,null,"Issue #17"]
[null,null,"Issue #18",null,null,"Issue Results"]
[null,null,"Issue #19",null,null,null,"Cause"]
[null,null,"Issue #20",null,null,null,"Effect"]
[null,null,"Issue #21"]
[null,null,"Issue #22",null,null,null,"CORE ISSUE"]
[null,null,"Issue #23"]
[null,null,"Issue #24"]
[null,null,"Issue #25"]
[null,null,"Issue #26"]
[null,null,"Issue #27"]
[null,null,"Issue #28"]
[null,null,"Issue #29"]

{"sheet":"PriorityWise 2","index":1,"n_rows":53,"n_cols":18,"rows_kept":53,"cut":false,"hidden":false,"merged":[[2,2,2,5],[9,2,9,5],[18,14,18,15],[18,16,18,17],[19,12,19,13],[19,14,19,15],[19,16,19,17],[12,2,12,5],[13,2,13,5],[14,2,14,5],[15,2,15,5],[16,2,16,5],[17,2,17,5],[18,2,18,5],[19,2,19,5],[18,7,18,8],[18,9,18,10],[19,7,19,8],[8,12,8,13],[9,12,9,13],[10,12,10,13],[11,12,11,13],[12,12,12,13],[13,12,13,13],[3,9,3,10],[10,2,11,5],[3,12,3,13],[3,7,3,8],[4,7,4,8],[4,9,4,10],[5,7,5,8],[5,9,5,10],[6,7,6,8],[6,9,6,10],[7,7,7,8],[7,9,7,10],[8,7,8,8],[8,9,8,10],[9,7,9,8],[9,9,9,10],[10,7,10,8],[10,9,10,10],[11,7,11,8],[11,9,11,10],[4,12,4,13],[5,12,5,13],[6,12,6,13],[7,12,7,13],[52,2,52,6],[52,7,52,8],[52,9,52,10],[52,11,52,12],[52,13,52,14],[52,15,52,16],[51,2,51,6],[51,7,51,8],[51,9,51,10],[51,11,51,12],[51,13,51,14],[51,15,51,16],[50,2,50,6],[50,7,50,8],[50,9,50,10],[50,11,50,12],[50,13,50,14],[50,15,50,16],[49,2,49,6],[49,7,49,8],[49,9,49,10],[49,11,49,12],[49,13,49,14],[49,15,49,16],[48,2,48,6],[48,7,48,8],[48,9,48,10],[48,11,48,12],[48,13,48,14],[48,15,48,16],[47,2,47,6],[47,7,47,8],[47,9,47,10],[47,11,47,12],[47,13,47,14],[47,15,47,16],[46,2,46,6],[46,7,46,8],[46,9,46,10],[46,11,46,12],[46,13,46,14],[46,15,46,16],[45,2,45,6],[45,7,45,8],[45,9,45,10],[45,11,45,12],[45,13,45,14],[45,15,45,16],[44,2,44,6],[44,7,44,8],[44,9,44,10],[44,11,44,12],[44,13,44,14],[44,15,44,16],[43,2,43,6],[43,7,43,8],[43,9,43,10],[43,11,43,12],[43,13,43,14],[43,15,43,16],[42,2,42,6],[42,7,42,8],[42,9,42,10],[42,11,42,12],[42,13,42,14],[42,15,42,16],[41,2,41,6],[41,7,41,8],[41,9,41,10],[41,11,41,12],[41,13,41,14],[41,15,41,16],[40,2,40,6],[40,7,40,8],[40,9,40,10],[40,11,40,12],[40,13,40,14],[40,15,40,16],[39,2,39,6],[39,7,39,8],[39,9,39,10],[39,11,39,12],[39,13,39,14],[39,15,39,16],[38,2,38,6],[38,7,38,8],[38,9,38,10],[38,11,38,12],[38,13,38,14],[38,15,38,16],[37,2,37,6],[37,7,37,8],[37,9,37,10],[37,11,37,12],[37,13,37,14],[37,15,37,16],[36,2,36,6],[36,7,36,8],[36,9,36,10],[36,11,36,12],[36,13,36,14],[36,15,36,16],[35,2,35,6],[35,7,35,8],[35,9,35,10],[35,11,35,12],[35,13,35,14],[35,15,35,16],[34,2,34,6],[34,7,34,8],[34,9,34,10],[34,11,34,12],[34,13,34,14],[34,15,34,16],[33,2,33,6],[33,7,33,8],[33,9,33,10],[33,11,33,12],[33,13,33,14],[33,15,33,16],[31,15,31,16],[32,2,32,6],[32,7,32,8],[32,9,32,10],[32,11,32,12],[32,13,32,14],[32,15,32,16],[30,7,30,8],[30,9,30,10],[30,11,30,12],[30,13,30,14],[30,15,30,16],[31,2,31,6],[31,7,31,8],[31,9,31,10],[31,11,31,12],[31,13,31,14],[30,2,30,6],[28,15,28,16],[29,2,29,6],[29,7,29,8],[29,9,29,10],[29,11,29,12],[29,13,29,14],[29,15,29,16],[27,7,27,8],[27,9,27,10],[27,11,27,12],[27,13,27,14],[27,15,27,16],[28,2,28,6],[28,7,28,8],[28,9,28,10],[28,11,28,12],[28,13,28,14],[27,2,27,6],[26,2,26,6],[26,7,26,8],[26,9,26,10],[26,11,26,12],[26,13,26,14],[26,15,26,16],[24,7,24,8],[24,9,24,10],[24,11,24,12],[24,13,24,14],[24,15,24,16],[25,2,25,6],[25,7,25,8],[25,9,25,10],[25,11,25,12],[25,13,25,14],[24,2,24,6],[22,7,22,16],[22,17,23,17],[23,7,23,8],[23,9,23,10],[23,11,23,12],[23,13,23,14],[23,15,23,16],[21,2,23,6],[25,15,25,16],[14,7,14,8],[14,9,14,10],[15,7,15,8],[15,9,15,10],[16,7,16,8],[16,9,16,10],[17,7,17,8],[17,9,17,10],[21,7,21,17],[19,9,19,10],[17,12,17,13],[18,12,18,13],[14,12,14,13],[15,12,15,13],[16,12,16,13],[10,14,10,15],[10,16,10,17],[11,14,11,15],[11,16,11,17],[16,14,16,15],[16,16,16,17],[17,14,17,15],[17,16,17,17],[14,14,14,15],[14,16,14,17],[15,14,15,15],[15,16,15,17],[3,2,8,5],[12,7,12,8],[12,9,12,10],[13,7,13,8],[13,9,13,10],[0,2,0,17],[4,14,4,15],[4,16,4,17],[5,14,5,15],[5,16,5,17],[3,14,3,15],[3,16,3,17],[8,14,8,15],[8,16,8,17],[9,14,9,15],[9,16,9,17],[6,14,6,15],[6,16,6,17],[7,14,7,15],[7,16,7,17],[12,14,12,15],[12,16,12,17],[13,14,13,15],[13,16,13,17]]}
["HOME",null,"PriorityWise 2"]
[]
[null,null,{"$f":"PriorityWise1!C3","v":"1. State the Situation"},null,null,null,null,"4. Develop an Action Plan"]
["BACK",null,{"$f":"IF(PriorityWise1!D3>0,PriorityWise1!D3,\"\")","v":"Shared situation text."},null,null,null,null,"Actions to be taken",null,"Who is responsible?",null,"Target Date","Identify Risks",null,"List likely Reasons",null,"Identify Avoiding Actions"]
[]
[]
[]
[]
[]
[null,null,{"$f":"PriorityWise1!F3","v":"2a. List the Stakeholders"}]
[null,null,{"$f":"IF(PriorityWise1!F4>0,PriorityWise1!F4,\"\")","v":"Who would be affected by this situation or who could influence this situation?"}]
[]
[null,null,{"$f":"IF(PriorityWise1!$F5>0,PriorityWise1!$F5,\"\")","v":"Stakeholder #1"}]
[null,null,{"$f":"IF(PriorityWise1!$F6>0,PriorityWise1!$F6,\"\")","v":""}]
[null,null,{"$f":"IF(PriorityWise1!$F7>0,PriorityWise1!$F7,\"\")","v":""}]
[null,null,{"$f":"IF(PriorityWise1!$F8>0,PriorityWise1!$F8,\"\")","v":""}]
[null,null,{"$f":"IF(PriorityWise1!$F9>0,PriorityWise1!$F9,\"\")","v":""}]
[null,null,{"$f":"IF(PriorityWise1!$F10>0,PriorityWise1!$F10,\"\")","v":""}]
[null,null,{"$f":"IF(PriorityWise1!$F11>0,PriorityWise1!$F11,\"\")","v":""}]
[null,null,{"$f":"IF(PriorityWise1!$F12>0,PriorityWise1!$F12,\"\")","v":""}]
[]
[null,null,{"$f":"PriorityWise1!C8","v":"2b. List Issues and Challenges"},null,null,null,null,{"$f":"PriorityWise1!F14","v":"3a. Select Criteria"}]
[null,null,null,null,null,null,null,"3b. Determine Priorities",null,null,null,null,null,null,null,null,null,"Overall Priority"]
[null,null,null,null,null,null,null,{"$f":"IF(PriorityWise1!G15>0,PriorityWise1!G15,\"\")","v":"Add 1 here"},null,{"$f":"IF(PriorityWise1!G16>0,PriorityWise1!G16,\"\")","v":"Add 2 here"},null,{"$f":"IF(PriorityWise1!G17>0,PriorityWise1!G17,\"\")","v":"Add 3 here"},null,{"$f":"IF(PriorityWise1!G18>0,PriorityWise1!G18,\"\")","v":"Add 4 here"},null,{"$f":"IF(PriorityWise1!G19>0,PriorityWise1!G19,\"\")","v":"Add 5 here"}]
[null,null,{"$f":"IF(PriorityWise1!C9:D9>0,PriorityWise1!C9:D9,\"\")","v":"Issue #1"}]
[null,null,{"$f":"IF(PriorityWise1!C10:D10>0,PriorityWise1!C10:D10,\"\")","v":"Issue #2"}]
[null,null,{"$f":"IF(PriorityWise1!C11:D11>0,PriorityWise1!C11:D11,\"\")","v":"Issue #3"}]
[null,null,{"$f":"IF(PriorityWise1!C12:D12>0,PriorityWise1!C12:D12,\"\")","v":"Issue #4"}]
[null,null,{"$f":"IF(PriorityWise1!C13:D13>0,PriorityWise1!C13:D13,\"\")","v":"Issue #5"}]
[null,null,{"$f":"IF(PriorityWise1!C14:D14>0,PriorityWise1!C14:D14,\"\")","v":"Issue #6"}]
[null,null,{"$f":"IF(PriorityWise1!C15:D15>0,PriorityWise1!C15:D15,\"\")","v":"Issue #7"}]
[null,null,{"$f":"IF(PriorityWise1!C16:D16>0,PriorityWise1!C16:D16,\"\")","v":"Issue #8"}]
[null,null,{"$f":"IF(PriorityWise1!C17:D17>0,PriorityWise1!C17:D17,\"\")","v":"Issue #9"}]
[null,null,{"$f":"IF(PriorityWise1!C18:D18>0,PriorityWise1!C18:D18,\"\")","v":"Issue #10"}]
[null,null,{"$f":"IF(PriorityWise1!C19:D19>0,PriorityWise1!C19:D19,\"\")","v":"Issue #11"}]
[null,null,{"$f":"IF(PriorityWise1!C20:D20>0,PriorityWise1!C20:D20,\"\")","v":"Issue #12"}]
[null,null,{"$f":"IF(PriorityWise1!C21:D21>0,PriorityWise1!C21:D21,\"\")","v":"Issue #13"}]
[null,null,{"$f":"IF(PriorityWise1!C22:D22>0,PriorityWise1!C22:D22,\"\")","v":"Issue #14"}]
[null,null,{"$f":"IF(PriorityWise1!C23:D23>0,PriorityWise1!C23:D23,\"\")","v":"Issue #15"}]
[null,null,{"$f":"IF(PriorityWise1!C24:D24>0,PriorityWise1!C24:D24,\"\")","v":"Issue #16"}]
[null,null,{"$f":"IF(PriorityWise1!C25:D25>0,PriorityWise1!C25:D25,\"\")","v":"Issue #17"}]
[null,null,{"$f":"IF(PriorityWise1!C26:D26>0,PriorityWise1!C26:D26,\"\")","v":"Issue #18"}]
[null,null,{"$f":"IF(PriorityWise1!C27:D27>0,PriorityWise1!C27:D27,\"\")","v":"Issue #19"}]
[null,null,{"$f":"IF(PriorityWise1!C28:D28>0,PriorityWise1!C28:D28,\"\")","v":"Issue #20"}]
[null,null,{"$f":"IF(PriorityWise1!C29:D29>0,PriorityWise1!C29:D29,\"\")","v":"Issue #21"}]
[null,null,{"$f":"IF(PriorityWise1!C30:D30>0,PriorityWise1!C30:D30,\"\")","v":"Issue #22"}]
[null,null,{"$f":"IF(PriorityWise1!C31:D31>0,PriorityWise1!C31:D31,\"\")","v":"Issue #23"}]
[null,null,{"$f":"IF(PriorityWise1!C32:D32>0,PriorityWise1!C32:D32,\"\")","v":"Issue #24"}]
[null,null,{"$f":"IF(PriorityWise1!C33:D33>0,PriorityWise1!C33:D33,\"\")","v":"Issue #25"}]
[null,null,{"$f":"IF(PriorityWise1!C34:D34>0,PriorityWise1!C34:D34,\"\")","v":"Issue #26"}]
[null,null,{"$f":"IF(PriorityWise1!C35:D35>0,PriorityWise1!C35:D35,\"\")","v":"Issue #27"}]
[null,null,{"$f":"IF(PriorityWise1!C36:D36>0,PriorityWise1!C36:D36,\"\")","v":"Issue #28"}]
[null,null,{"$f":"IF(PriorityWise1!C37:D37>0,PriorityWise1!C37:D37,\"\")","v":"Issue #29"}]

{"sheet":"Master Lists","index":2,"n_rows":20,"n_cols":9,"rows_kept":20,"cut":false,"hidden":true,"merged":[]}
["PRIORITYWISE LISTS",null,"THINKINGWISE LISTS",null,"SOLUTIONWISE LISTS",null,"CAUSEWISE LISTS",null,"RISKWISE LISTS"]
[]
["High",null,"√",null,3,null,"YES",null,"H"]
["Medium",null,null,null,2,null,"NO",null,"M"]
["Low",null,null,null,1,null,"A",null,"L"]
[null,null,null,null,0]
["Cause "]
["Effect",null,null,null,1]
[null,null,null,null,2]
["Core Issue",null,null,null,3]
[null,null,null,null,4]
[null,null,null,null,5]
[null,null,null,null,6]
["Home",null,null,null,7]
[null,null,null,null,8]
[null,null,null,null,9]
[null,null,null,null,10]
[]
[null,null,null,null,"YES"]
[null,null,null,null,"NO"]