{"text_format":"1","workbook":"xlsx","n_sheets":4,"sheets":["Home","PriorityWise 1","PriorityWise 2","Master Lists"],"not_rendered":{"charts":0,"images":6,"macros":1,"external_links":0,"defined_names":0,"comments":2,"pivot_tables":0},"unopened":[],"bounds":{"document_bytes":16777216,"sheet_cells":100000,"rows_first":2000,"rows_last":500,"rows_between":2000,"halvings":0,"cell_chars":16384,"cell_head_chars":4096},"cells_cut":0,"cells_raw":0,"read":"whole","date_system":"1900"}

{"sheet":"Home","index":0,"n_rows":18,"n_cols":3,"rows_kept":18,"cut":false,"hidden":false,"merged":[]}
[]
[null,null,"PriorityWise One"]
[null,null,"PriorityWise  Two"]
[]
[null,null,"ThinkingWise One"]
[null,null,"ThinkingWise Two"]
[]
[null,null,"CauseWise Statement"]
[null,null,"CauseWise - Intuitive Detail"]
[null,null,"CauseWise - Analytical Detail"]
[null,null,"CauseWise - Causes and Confirmation"]
[]
[null,null,"SolutionWise Requirements"]
[null,null,"SolutionWise - Maxfour"]
[null,null,"SolutionWise - Create a Solution"]
[null,null,"SolutionWise - Making a Choice"]
[]
[null,null,"RiskWise"]

{"sheet":"PriorityWise 1","index":1,"n_rows":36,"n_cols":8,"rows_kept":36,"cut":false,"hidden":false,"merged":[[17,7,17,8],[18,7,18,8],[19,7,19,8],[13,7,13,8],[11,2,11,4],[12,2,12,4],[13,2,13,4],[14,2,14,4],[15,2,15,4],[11,7,11,8],[12,7,12,8],[17,2,17,4],[0,2,0,8],[2,4,4,8],[14,7,14,8],[15,7,15,8],[16,7,16,8],[7,7,7,8],[8,7,8,8],[9,7,9,8],[10,7,10,8],[7,2,7,4],[8,2,8,4],[9,2,9,4],[10,2,10,4],[20,7,20,8],[21,7,21,8],[22,7,22,8],[23,7,23,8],[24,7,24,8],[25,7,25,8],[26,7,26,8],[27,7,27,8],[28,7,28,8],[29,7,29,8],[28,2,28,4],[35,7,35,8],[2,2,2,3],[3,2,3,3],[4,2,4,3],[19,3,19,4],[20,3,20,4],[21,3,21,4],[22,3,22,4],[18,3,18,4],[6,6,6,8],[30,7,30,8],[31,7,31,8],[32,7,32,8],[33,7,33,8],[34,7,34,8]]}
["HOME",null,"PriorityWise 1"]
[]
["NEXT",null,"1. State the Situation"]
[]
[]
[]
[null,null,"2a. List the Stakeholders",null,null,null,"2b. List Issues and Challenges"]
[null,null,"Who would be affected by this situation or who could influence this situation?",null,null,null,1,"Issue #1"]
[null,null,"Stakeholder #1",null,null,null,2,"Issue #2"]
[null,null,"Stakeholder #2",null,null,null,3,"Issue #3"]
[null,null,"Stakeholder #3",null,null,null,4,"Issue #4"]
[null,null,null,null,null,null,5,"Issue #5"]
[null,null,null,null,null,null,6,"Issue #6"]
[null,null,null,null,null,null,7,"Issue #7"]
[null,null,null,null,null,null,8,"Issue #8"]
[null,null,null,null,null,null,9,"Issue #9"]
[null,null,null,null,null,null,10,"Issue #10"]
[null,null,"3a. Select Criteria",null,null,null,11,"Issue #11"]
[null,null,"Criteria 1","Add 1 here",null,null,12,"Issue #12"]
[null,null,"Criteria 2","Add 2 here",null,null,13,"Issue #13"]
[null,null,"Criteria 3","Add 3 here",null,null,14,"Issue #14"]
[null,null,"Criteria 4","Add 4 here",null,null,15,"Issue #15"]
[null,null,"Criteria 5","Add 5 here",null,null,16,"Issue #16"]
[null,null,null,null,null,null,17,"Issue #17"]
[null,null,null,null,null,null,18,"Issue #18"]
[null,null,null,null,null,null,19,"Issue #19"]
[null,null,null,null,null,null,20,"Issue #20"]
[null,null,null,null,null,null,21,"Issue #21"]
[null,null,"Copyright © 1998-2016 Thinking Dimensions Global. All rights Reserved.",null,null,null,22,"Issue #22"]
[null,null,null,null,null,null,23,"Issue #23"]
[null,null,null,null,null,null,24,"Issue #24"]
[null,null,null,null,null,null,25,"Issue #25"]
[null,null,null,null,null,null,26,"Issue #26"]
[null,null,null,null,null,null,27,"Issue #27"]
[null,null,null,null,null,null,28,"Issue #28"]
[null,null,null,null,null,null,29,"Issue #29"]

{"sheet":"PriorityWise 2","index":2,"n_rows":55,"n_cols":19,"rows_kept":55,"cut":false,"hidden":false,"merged":[[14,15,14,16],[14,17,14,18],[15,15,15,16],[15,17,15,18],[15,8,15,10],[16,8,16,10],[17,8,17,10],[5,17,5,18],[3,15,3,16],[3,17,3,18],[8,15,8,16],[8,17,8,18],[9,15,9,16],[9,17,9,18],[6,15,6,16],[6,17,6,18],[7,15,7,16],[7,17,7,18],[23,8,23,9],[23,10,23,11],[23,12,23,13],[23,14,23,15],[23,16,23,17],[12,15,12,16],[12,17,12,18],[13,15,13,16],[13,17,13,18],[14,13,14,14],[15,13,15,14],[16,13,16,14],[18,17,18,18],[19,13,19,14],[19,15,19,16],[19,17,19,18],[16,15,16,16],[12,8,12,10],[13,8,13,10],[14,8,14,10],[16,17,16,18],[17,15,17,16],[17,17,17,18],[19,8,19,10],[21,8,21,18],[17,13,17,14],[18,13,18,14],[26,3,26,7],[26,8,26,9],[26,10,26,11],[26,12,26,13],[26,14,26,15],[26,16,26,17],[24,8,24,9],[24,10,24,11],[24,12,24,13],[24,14,24,15],[24,16,24,17],[25,3,25,7],[25,8,25,9],[25,10,25,11],[25,12,25,13],[25,14,25,15],[24,3,24,7],[25,16,25,17],[22,8,22,17],[18,8,18,10],[22,18,23,18],[28,16,28,17],[29,8,29,9],[29,10,29,11],[29,12,29,13],[29,14,29,15],[29,16,29,17],[27,8,27,9],[27,10,27,11],[27,12,27,13],[27,14,27,15],[27,16,27,17],[28,8,28,9],[28,10,28,11],[28,12,28,13],[28,14,28,15],[30,8,30,9],[30,10,30,11],[30,12,30,13],[30,14,30,15],[30,16,30,17],[31,8,31,9],[31,10,31,11],[31,12,31,13],[31,14,31,15],[33,3,33,7],[33,8,33,9],[33,10,33,11],[33,12,33,13],[33,14,33,15],[33,16,33,17],[31,16,31,17],[32,3,32,7],[32,8,32,9],[32,10,32,11],[32,12,32,13],[32,14,32,15],[32,16,32,17],[35,3,35,7],[35,8,35,9],[35,10,35,11],[35,12,35,13],[35,14,35,15],[35,16,35,17],[34,3,34,7],[34,8,34,9],[34,10,34,11],[34,12,34,13],[34,14,34,15],[34,16,34,17],[37,3,37,7],[37,8,37,9],[37,10,37,11],[37,12,37,13],[37,14,37,15],[37,16,37,17],[36,3,36,7],[36,8,36,9],[36,10,36,11],[36,12,36,13],[36,14,36,15],[36,16,36,17],[39,3,39,7],[39,8,39,9],[39,10,39,11],[39,12,39,13],[39,14,39,15],[39,16,39,17],[38,3,38,7],[38,8,38,9],[38,10,38,11],[38,12,38,13],[38,14,38,15],[38,16,38,17],[41,3,41,7],[41,8,41,9],[41,10,41,11],[41,12,41,13],[41,14,41,15],[41,16,41,17],[40,3,40,7],[40,8,40,9],[40,10,40,11],[40,12,40,13],[40,14,40,15],[40,16,40,17],[43,3,43,7],[43,8,43,9],[43,10,43,11],[43,12,43,13],[43,14,43,15],[43,16,43,17],[42,3,42,7],[42,8,42,9],[42,10,42,11],[42,12,42,13],[42,14,42,15],[42,16,42,17],[45,3,45,7],[45,8,45,9],[45,10,45,11],[45,12,45,13],[45,14,45,15],[45,16,45,17],[44,3,44,7],[44,8,44,9],[44,10,44,11],[44,12,44,13],[44,14,44,15],[44,16,44,17],[48,14,48,15],[48,16,48,17],[47,3,47,7],[47,8,47,9],[47,10,47,11],[47,12,47,13],[47,14,47,15],[47,16,47,17],[46,3,46,7],[46,8,46,9],[46,10,46,11],[46,12,46,13],[46,14,46,15],[46,16,46,17],[48,8,48,9],[48,10,48,11],[48,12,48,13],[51,16,51,17],[50,8,50,9],[50,10,50,11],[50,12,50,13],[50,14,50,15],[50,16,50,17],[49,8,49,9],[49,10,49,11],[49,12,49,13],[49,14,49,15],[49,16,49,17],[51,10,51,11],[51,12,51,13],[51,14,51,15],[0,2,0,18],[2,2,2,6],[9,2,9,6],[12,2,12,6],[13,2,13,6],[14,2,14,6],[9,13,9,14],[10,13,10,14],[11,13,11,14],[12,13,12,14],[13,13,13,14],[11,17,11,18],[8,13,8,14],[4,15,4,16],[3,8,3,10],[4,8,4,10],[5,8,5,10],[6,8,6,10],[7,8,7,10],[10,15,10,16],[10,17,10,18],[11,15,11,16],[4,17,4,18],[5,15,5,16],[15,2,15,6],[16,2,16,6],[17,2,17,6],[3,13,3,14],[4,13,4,14],[5,13,5,14],[6,13,6,14],[7,13,7,14],[8,8,8,10],[9,8,9,10],[10,8,10,10],[11,8,11,10],[54,7,54,11],[21,2,23,7],[3,2,8,6],[10,2,11,6],[2,8,2,16],[49,3,49,7],[50,3,50,7],[51,3,51,7],[52,3,52,7],[27,3,27,7],[28,3,28,7],[29,3,29,7],[30,3,30,7],[31,3,31,7],[48,3,48,7],[18,2,18,6],[19,2,19,6],[18,15,18,16],[52,8,52,9],[52,10,52,11],[52,12,52,13],[52,14,52,15],[52,16,52,17],[51,8,51,9]]}
["HOME",null,"PriorityWise 2"]
[]
[null,null,{"$f":"'PriorityWise 1'!C3","v":"1. State the Situation"},null,null,null,null,null,"4. Develop an Action Plan"]
["BACK",null,{"$f":"IF('PriorityWise 1'!E3>0,'PriorityWise 1'!E3,\"\")","v":""},null,null,null,null,null,"Actions to be taken",null,null,"Responsible","Target Date","Identify Risks",null,"List likely Reasons",null,"Identify Avoiding Actions"]
[]
[]
[]
[]
[]
[null,null,{"$f":"'PriorityWise 1'!C7","v":"2a. List the Stakeholders"}]
[null,null,{"$f":"IF('PriorityWise 1'!C8>0,'PriorityWise 1'!C8,\"\")","v":"Who would be affected by this situation or who could influence this situation?"}]
[]
[null,null,{"$f":"IF('PriorityWise 1'!$C9>0,'PriorityWise 1'!$C9,\"\")","v":"Stakeholder #1"}]
[null,null,{"$f":"IF('PriorityWise 1'!$C10>0,'PriorityWise 1'!$C10,\"\")","v":"Stakeholder #2"}]
[null,null,{"$f":"IF('PriorityWise 1'!$C11>0,'PriorityWise 1'!$C11,\"\")","v":"Stakeholder #3"}]
[null,null,{"$f":"IF('PriorityWise 1'!$C12>0,'PriorityWise 1'!$C12,\"\")","v":""}]
[null,null,{"$f":"IF('PriorityWise 1'!$C13>0,'PriorityWise 1'!$C13,\"\")","v":""}]
[null,null,{"$f":"IF('PriorityWise 1'!$C14>0,'PriorityWise 1'!$C14,\"\")","v":""}]
[null,null,{"$f":"IF('PriorityWise 1'!$C15>0,'PriorityWise 1'!$C15,\"\")","v":""}]
[null,null,{"$f":"IF('PriorityWise 1'!$C16>0,'PriorityWise 1'!$C16,\"\")","v":""}]
[]
[null,null,{"$f":"'PriorityWise 1'!G7","v":"2b. List Issues and Challenges"},null,null,null,null,null,{"$f":"'PriorityWise 1'!C18","v":"3a. Select Criteria"}]
[null,null,null,null,null,null,null,null,"3b. Determine Priorities",null,null,null,null,null,null,null,null,null,"Overall Priority"]
[null,null,null,null,null,null,null,null,{"$f":"IF('PriorityWise 1'!D19>0,'PriorityWise 1'!D19,\"\")","v":"Add 1 here"},null,{"$f":"IF('PriorityWise 1'!D20>0,'PriorityWise 1'!D20,\"\")","v":"Add 2 here"},null,{"$f":"IF('PriorityWise 1'!D21>0,'PriorityWise 1'!D21,\"\")","v":"Add 3 here"},null,{"$f":"IF('PriorityWise 1'!D22>0,'PriorityWise 1'!D22,\"\")","v":"Add 4 here"},null,{"$f":"IF('PriorityWise 1'!D23>0,'PriorityWise 1'!D23,\"\")","v":"Add 5 here"}]
[null,null,1,{"$f":"IF('PriorityWise 1'!H8>0,'PriorityWise 1'!H8,\"\")","v":"Issue #1"}]
[null,null,2,{"$f":"IF('PriorityWise 1'!H9>0,'PriorityWise 1'!H9,\"\")","v":"Issue #2"}]
[null,null,3,{"$f":"IF('PriorityWise 1'!H10>0,'PriorityWise 1'!H10,\"\")","v":"Issue #3"}]
[null,null,4,{"$f":"IF('PriorityWise 1'!H11>0,'PriorityWise 1'!H11,\"\")","v":"Issue #4"}]
[null,null,5,{"$f":"IF('PriorityWise 1'!H12>0,'PriorityWise 1'!H12,\"\")","v":"Issue #5"}]
[null,null,6,{"$f":"IF('PriorityWise 1'!H13>0,'PriorityWise 1'!H13,\"\")","v":"Issue #6"}]
[null,null,7,{"$f":"IF('PriorityWise 1'!H14>0,'PriorityWise 1'!H14,\"\")","v":"Issue #7"}]
[null,null,8,{"$f":"IF('PriorityWise 1'!H15>0,'PriorityWise 1'!H15,\"\")","v":"Issue #8"}]
[null,null,9,{"$f":"IF('PriorityWise 1'!H16>0,'PriorityWise 1'!H16,\"\")","v":"Issue #9"}]
[null,null,10,{"$f":"IF('PriorityWise 1'!H17>0,'PriorityWise 1'!H17,\"\")","v":"Issue #10"}]
[null,null,11,{"$f":"IF('PriorityWise 1'!H18>0,'PriorityWise 1'!H18,\"\")","v":"Issue #11"}]
[null,null,12,{"$f":"IF('PriorityWise 1'!H19>0,'PriorityWise 1'!H19,\"\")","v":"Issue #12"}]
[null,null,13,{"$f":"IF('PriorityWise 1'!H20>0,'PriorityWise 1'!H20,\"\")","v":"Issue #13"}]
[null,null,14,{"$f":"IF('PriorityWise 1'!H21>0,'PriorityWise 1'!H21,\"\")","v":"Issue #14"}]
[null,null,15,{"$f":"IF('PriorityWise 1'!H22>0,'PriorityWise 1'!H22,\"\")","v":"Issue #15"}]
[null,null,16,{"$f":"IF('PriorityWise 1'!H23>0,'PriorityWise 1'!H23,\"\")","v":"Issue #16"}]
[null,null,17,{"$f":"IF('PriorityWise 1'!H24>0,'PriorityWise 1'!H24,\"\")","v":"Issue #17"}]
[null,null,18,{"$f":"IF('PriorityWise 1'!H25>0,'PriorityWise 1'!H25,\"\")","v":"Issue #18"}]
[null,null,19,{"$f":"IF('PriorityWise 1'!H26>0,'PriorityWise 1'!H26,\"\")","v":"Issue #19"}]
[null,null,20,{"$f":"IF('PriorityWise 1'!H27>0,'PriorityWise 1'!H27,\"\")","v":"Issue #20"}]
[null,null,21,{"$f":"IF('PriorityWise 1'!H28>0,'PriorityWise 1'!H28,\"\")","v":"Issue #21"}]
[null,null,22,{"$f":"IF('PriorityWise 1'!H29>0,'PriorityWise 1'!H29,\"\")","v":"Issue #22"}]
[null,null,23,{"$f":"IF('PriorityWise 1'!H30>0,'PriorityWise 1'!H30,\"\")","v":"Issue #23"}]
[null,null,24,{"$f":"IF('PriorityWise 1'!H31>0,'PriorityWise 1'!H31,\"\")","v":"Issue #24"}]
[null,null,25,{"$f":"IF('PriorityWise 1'!H32>0,'PriorityWise 1'!H32,\"\")","v":"Issue #25"}]
[null,null,26,{"$f":"IF('PriorityWise 1'!H33>0,'PriorityWise 1'!H33,\"\")","v":"Issue #26"}]
[null,null,27,{"$f":"IF('PriorityWise 1'!H34>0,'PriorityWise 1'!H34,\"\")","v":"Issue #27"}]
[null,null,28,{"$f":"IF('PriorityWise 1'!H35>0,'PriorityWise 1'!H35,\"\")","v":"Issue #28"}]
[null,null,29,{"$f":"IF('PriorityWise 1'!H36>0,'PriorityWise 1'!H36,\"\")","v":"Issue #29"}]
[]
[null,null,null,null,null,null,null,"Copyright © 1998-2016 Thinking Dimensions Global. All rights Reserved."]

{"sheet":"Master Lists","index":3,"n_rows":28,"n_cols":9,"rows_kept":28,"cut":false,"hidden":true,"merged":[]}
["PRIORITYWISE LISTS",null,"THINKINGWISE LISTS",null,"SOLUTIONWISE LISTS",null,"CAUSEWISE LISTS",null,"RISKWISE LISTS"]
[]
["High",null,"√",null,3,null,"YES",null,"H"]
["Medium",null,"½",null,2,null,"NO",null,"M"]
["Low",null,null,null,1,null,"A",null,"L"]
[null,null,null,null,0]
["Cause "]
["Effect",null,null,null,1]
[null,null,null,null,2]
["Core Issue",null,null,null,3]
[null,null,null,null,4]
[null,null,null,null,5]
[null,null,null,null,6]
["Home",null,null,null,7]
[null,null,null,null,8]
[null,null,null,null,9]
[null,null,null,null,10]
[]
[null,null,null,null,"YES"]
[null,null,null,null,"NO"]
[null,null,null,null,"N/A"]
[]
[null,null,null,null,"√"]
[null,null,null,null,"½"]
[]
[null,null,null,null,"Min. Req."]
[]
[null,null,null,null,"Best Alternative"]