{"text_format":"1","workbook":"xlsx","n_sheets":6,"sheets":["Master Lists","Home","SolutionWise Req's","Max4","Create a Solution","Making a Choice"],"not_rendered":{"charts":0,"images":6,"macros":1,"external_links":0,"defined_names":0,"comments":4,"pivot_tables":0},"unopened":[],"bounds":{"document_bytes":16777216,"sheet_cells":100000,"rows_first":2000,"rows_last":500,"rows_between":2000,"halvings":0,"cell_chars":16384,"cell_head_chars":4096},"cells_cut":0,"cells_raw":0,"read":"whole","date_system":"1900"}

{"sheet":"Master Lists","index":0,"n_rows":28,"n_cols":9,"rows_kept":28,"cut":false,"hidden":true,"merged":[]}
["PRIORITYWISE LISTS",null,"THINKINGWISE LISTS",null,"SOLUTIONWISE LISTS",null,"CAUSEWISE LISTS",null,"RISKWISE LISTS"]
[]
["High",null,"√",null,3,null,"YES",null,"H"]
["Medium",null,"½",null,2,null,"NO",null,"M"]
["Low",null,null,null,1,null,"A",null,"L"]
[null,null,null,null,0]
["Cause "]
["Effect",null,null,null,1]
[null,null,null,null,2]
["Core Issue",null,null,null,3]
[null,null,null,null,4]
[null,null,null,null,5]
[null,null,null,null,6]
["Home",null,null,null,7]
[null,null,null,null,8]
{"$rows_left_out":14}
{"sheet":"Home","index":1,"n_rows":18,"n_cols":3,"rows_kept":18,"cut":false,"hidden":false,"merged":[]}
[]
[null,null,"PriorityWise One"]
[null,null,"PriorityWise  Two"]
[]
[null,null,"ThinkingWise One"]
[null,null,"ThinkingWise Two"]
[]
[null,null,"CauseWise Statement"]
[null,null,"CauseWise - Intuitive Detail"]
[null,null,"CauseWise - Analytical Detail"]
[null,null,"CauseWise - Causes and Confirmation"]
[]
[null,null,"SolutionWise Requirements"]
[null,null,"SolutionWise - Maxfour"]
[null,null,"SolutionWise - Create a Solution"]
{"$rows_left_out":4}
{"sheet":"SolutionWise Req's","index":2,"n_rows":45,"n_cols":11,"rows_kept":45,"cut":false,"hidden":false,"merged":[[14,2,14,3],[45,2,46,11],[39,2,39,3],[40,2,40,3],[41,2,41,3],[42,2,42,3],[39,9,40,9],[39,10,40,10],[37,2,37,3],[38,2,38,3],[26,2,26,3],[15,2,15,3],[16,2,16,3],[17,2,17,3],[18,2,18,3],[19,2,19,3],[9,2,9,3],[10,2,10,3],[11,2,11,3],[12,2,12,3],[13,2,13,3],[20,2,20,3],[0,2,0,10],[33,2,33,3],[34,2,34,3],[35,2,35,3],[21,2,21,3],[22,2,22,3],[23,2,23,3],[24,2,24,3],[25,2,25,3],[2,2,2,7],[5,9,6,9],[5,10,6,10],[7,9,8,9],[7,10,8,10],[5,2,5,6],[36,2,36,3],[27,2,27,3],[28,2,28,3],[29,2,29,3],[30,2,30,3],[31,2,31,3],[32,2,32,3],[6,2,6,6],[7,2,7,6],[8,2,8,6],[3,2,3,7],[2,9,3,10],[9,9,10,9],[9,10,10,10],[11,9,12,9],[11,10,12,10],[13,9,14,9],[13,10,14,10],[15,9,16,9],[15,10,16,10],[17,9,18,9],[17,10,18,10],[19,9,20,9],[19,10,20,10],[21,9,22,9],[21,10,22,10],[23,9,24,9],[23,10,24,10],[25,9,26,9],[25,10,26,10],[27,9,28,9],[27,10,28,10],[29,9,30,9],[29,10,30,10],[31,9,32,9],[31,10,32,10],[33,9,34,9],[33,10,34,10],[35,9,36,9],[35,10,36,10],[37,9,38,9],[37,10,38,10]]}
["HOME",null,"SolutionWise - Solution Requirements"]
[]
["NEXT",null,"1. State the Purpose ",null,null,null,null,null,null,"2c. Identify Key Requirements"]
[null,null,"Select an MDM vendor for Verizon EMM product"]
[]
[null,null,"2. Clarify Solution Requirements",null,null,null,null,null,null,1,"Proactive enrollment process - not user prompted"]
[null,null,"2a. List all stakeholders: Involve all people who have an impact on the issue or are affected by the decision"]
[null,null,"Sourcing, Product Management, Operations, current customers, future customers, Legal, VzW",null,null,null,null,null,null,2,"Strong existing customer base"]
[null,null,"2b. List Requirements"]
[null,null,"Requirements to Fulfill",null,"√",null,"Problems / Symptoms to Remove","√",null,3,"Supports IOS, Android, Windows, and Windows Phone devices"]
[null,null,"List the main and secondary results required",null,null,null,"List the problems/symptoms you want to remove"]
[null,null,"Proactive enrollment process - not user prompted",null,"√",null,"Constant releases being put into production",null,null,4,"Service can be run in the Cloud by Verizon"]
[null,null,"Strong existing customer base",null,"√",null,"Inability to mass provision devices","√"]
[null,null,"Supports IOS, Android, Windows, and Windows Phone devices",null,"√",null,"Customers cannot choose Vz managed service w/o bringing licenses","√",null,5,"Licenses are less than $5 per month per user and are tiered by # of licenses"]
[null,null,"Supports silent installation of applications",null,null,null,"Customers cannot make quick changes via portal to their devices"]
{"$rows_left_out":31}
{"sheet":"Max4","index":3,"n_rows":54,"n_cols":28,"rows_kept":54,"cut":false,"hidden":false,"merged":[[53,4,53,16],[15,25,15,31],[0,2,0,23],[8,5,8,23],[2,2,2,3],[2,4,2,23],[4,2,4,3],[6,5,6,23],[7,5,7,23],[16,6,16,23],[16,2,17,5],[9,5,9,23],[10,5,10,23],[11,5,11,23],[12,5,12,23],[13,5,13,23],[14,5,14,23],[28,3,28,5],[23,3,23,5],[24,3,24,5],[25,3,25,5],[26,3,26,5],[27,3,27,5],[29,3,29,5],[30,3,30,5],[18,3,18,5],[19,3,19,5],[20,3,20,5],[21,3,21,5],[22,3,22,5],[42,4,42,7],[43,4,43,7],[44,4,44,7],[39,4,39,7],[40,4,40,7],[41,4,41,7],[33,4,33,7],[34,4,34,7],[35,4,35,7],[36,4,36,7],[37,4,37,7],[38,4,38,7],[33,27,33,31],[34,27,34,31],[35,27,35,31],[36,27,36,31],[37,27,37,31],[38,27,38,31],[39,27,39,31],[40,27,40,31],[41,27,41,31],[33,8,33,12],[47,4,47,7],[48,4,48,7],[49,4,49,7],[50,4,50,7],[51,4,51,7],[47,8,47,12],[48,8,48,12],[49,8,49,12],[45,4,45,7],[46,4,46,7],[45,8,45,12],[46,8,46,12],[50,8,50,12],[51,8,51,12],[51,21,51,26],[43,13,43,20],[33,21,33,26],[34,21,34,26],[35,21,35,26],[36,21,36,26],[37,21,37,26],[38,21,38,26],[39,21,39,26],[40,21,40,26],[41,21,41,26],[42,21,42,26],[43,21,43,26],[33,13,33,20],[51,13,51,20],[48,13,48,20],[34,13,34,20],[35,13,35,20],[36,13,36,20],[37,13,37,20],[38,13,38,20],[39,13,39,20],[40,13,40,20],[41,13,41,20],[47,27,47,31],[38,8,38,12],[39,8,39,12],[40,8,40,12],[41,8,41,12],[42,8,42,12],[34,8,34,12],[35,8,35,12],[36,8,36,12],[37,8,37,12],[43,8,43,12],[44,8,44,12],[48,21,48,26],[42,13,42,20],[51,27,51,31],[32,2,32,31],[48,27,48,31],[49,13,49,20],[49,21,49,26],[49,27,49,31],[50,13,50,20],[50,21,50,26],[50,27,50,31],[42,27,42,31],[43,27,43,31],[44,13,44,20],[44,21,44,26],[44,27,44,31],[45,13,45,20],[45,21,45,26],[45,27,45,31],[46,13,46,20],[46,21,46,26],[46,27,46,31],[47,13,47,20],[47,21,47,26]]}
["HOME",null,"SolutionWise - Max4 Method"]
[]
["NEXT",null,"1. State the Purpose",null,{"$f":"IF('SolutionWise Req''s'!C4<>\"\",'SolutionWise Req''s'!C4,\"\")","v":"Select an MDM vendor for Verizon EMM product"}]
["BACK"]
[null,null,"3a: Generate Actions"]
[]
[null,null,1,null,10]
[null,null,2,null,11]
[null,null,3,null,12]
[null,null,4,null,13]
[null,null,5,null,14]
[null,null,6,null,15]
[null,null,7,null,16]
[null,null,8,null,17]
[null,null,9,null,18]
{"$rows_left_out":40}
{"sheet":"Create a Solution","index":4,"n_rows":53,"n_cols":21,"rows_kept":53,"cut":false,"hidden":false,"merged":[[49,7,49,10],[50,7,50,10],[40,5,40,6],[47,14,47,17],[48,14,48,17],[49,14,49,17],[50,14,50,17],[44,5,44,6],[51,3,51,9],[46,7,46,10],[40,14,40,17],[41,14,41,17],[42,14,42,17],[43,14,43,17],[44,14,44,17],[45,14,45,17],[47,7,47,10],[48,7,48,10],[53,3,53,9],[52,4,52,7],[6,20,7,20],[8,20,9,20],[10,20,11,20],[12,20,13,20],[14,20,15,20],[16,20,17,20],[18,20,19,20],[20,20,21,20],[22,20,23,20],[30,9,31,9],[30,11,31,11],[30,13,31,13],[24,20,25,20],[26,20,27,20],[28,20,29,20],[30,20,31,20],[32,20,33,20],[34,20,35,20],[24,16,25,16],[32,19,33,19],[30,15,31,15],[26,17,27,17],[26,18,27,18],[28,18,29,18],[30,18,31,18],[32,18,33,18],[34,18,35,18],[28,10,29,10],[30,10,31,10],[32,10,33,10],[34,10,35,10],[26,14,27,14],[28,14,29,14],[30,14,31,14],[32,14,33,14],[34,14,35,14],[26,16,27,16],[28,16,29,16],[30,16,31,16],[32,16,33,16],[34,16,35,16],[26,19,27,19],[32,15,33,15],[32,17,33,17],[34,17,35,17],[18,12,19,12],[20,12,21,12],[22,12,23,12],[6,16,7,16],[8,16,9,16],[10,16,11,16],[12,16,13,16],[14,16,15,16],[16,16,17,16],[18,16,19,16],[20,16,21,16],[22,16,23,16],[6,18,7,18],[8,18,9,18],[10,19,11,19],[12,19,13,19],[12,14,13,14],[10,18,11,18],[12,18,13,18],[14,19,15,19],[10,3,11,3],[12,3,13,3],[14,3,15,3],[16,3,17,3],[18,3,19,3],[20,3,21,3],[6,2,7,2],[6,10,7,10],[8,10,9,10],[10,10,11,10],[12,10,13,10],[14,10,15,10],[16,10,17,10],[18,10,19,10],[20,10,21,10],[18,2,19,2],[20,2,21,2],[8,2,9,2],[10,2,11,2],[12,2,13,2],[14,2,15,2],[16,2,17,2],[8,7,9,7],[8,9,9,9],[6,6,7,6],[8,6,9,6],[6,17,7,17],[6,12,7,12],[8,12,9,12],[0,2,0,19],[6,3,7,3],[8,3,9,3],[2,2,2,3],[4,2,4,3],[6,19,7,19],[8,11,9,11],[8,13,9,13],[8,15,9,15],[8,17,9,17],[8,19,9,19],[6,7,7,7],[6,9,7,9],[6,8,7,8],[8,8,9,8],[2,4,2,20],[4,4,4,5],[5,4,5,5],[6,4,7,5],[10,6,11,6],[12,6,13,6],[10,17,11,17],[10,12,11,12],[12,12,13,12],[6,11,7,11],[6,13,7,13],[6,15,7,15],[6,14,7,14],[8,14,9,14],[10,8,11,8],[12,8,13,8],[12,7,13,7],[12,9,13,9],[12,11,13,11],[12,13,13,13],[12,15,13,15],[12,17,13,17],[10,7,11,7],[10,9,11,9],[10,11,11,11],[10,13,11,13],[10,15,11,15],[10,14,11,14],[16,7,17,7],[16,9,17,9],[16,11,17,11],[16,13,17,13],[16,15,17,15],[16,17,17,17],[16,19,17,19],[14,7,15,7],[14,9,15,9],[14,11,15,11],[14,13,15,13],[14,15,15,15],[14,14,15,14],[16,14,17,14],[14,18,15,18],[16,18,17,18],[14,17,15,17],[14,12,15,12],[16,12,17,12],[14,8,15,8],[16,8,17,8],[22,18,23,18],[24,18,25,18],[22,17,23,17],[18,19,19,19],[20,7,21,7],[20,9,21,9],[20,11,21,11],[20,13,21,13],[20,15,21,15],[20,17,21,17],[20,19,21,19],[18,7,19,7],[18,9,19,9],[18,11,19,11],[18,13,19,13],[18,15,19,15],[18,14,19,14],[20,14,21,14],[18,18,19,18],[20,18,21,18],[18,17,19,17],[24,12,25,12],[18,8,19,8],[20,8,21,8],[28,19,29,19],[32,4,33,5],[26,7,27,7],[26,9,27,9],[26,11,27,11],[26,13,27,13],[26,15,27,15],[22,19,23,19],[24,7,25,7],[24,9,25,9],[24,11,25,11],[24,13,25,13],[24,15,25,15],[24,17,25,17],[24,19,25,19],[22,7,23,7],[22,9,23,9],[22,11,23,11],[22,13,23,13],[22,15,23,15],[22,10,23,10],[24,10,25,10],[22,14,23,14],[24,14,25,14],[34,19,35,19],[16,6,17,6],[18,6,19,6],[20,6,21,6],[22,6,23,6],[24,6,25,6],[26,6,27,6],[28,6,29,6],[30,6,31,6],[32,6,33,6],[34,6,35,6],[34,7,35,7],[34,9,35,9],[34,11,35,11],[34,13,35,13],[34,15,35,15],[30,17,31,17],[30,19,31,19],[32,7,33,7],[32,9,33,9],[32,11,33,11],[32,13,33,13],[28,7,29,7],[28,9,29,9],[8,4,9,5],[10,4,11,5],[49,5,49,6],[50,5,50,6],[40,11,40,13],[41,11,41,13],[42,11,42,13],[43,11,43,13],[44,11,44,13],[45,11,45,13],[46,11,46,13],[47,11,47,13],[48,11,48,13],[49,11,49,13],[50,11,50,13],[40,7,40,10],[41,7,41,10],[42,7,42,10],[43,7,43,10],[44,7,44,10],[45,7,45,10],[12,4,13,5],[14,4,15,5],[16,4,17,5],[18,4,19,5],[20,4,21,5],[45,5,45,6],[46,5,46,6],[47,5,47,6],[48,5,48,6],[14,6,15,6],[36,2,36,19],[22,3,23,3],[24,3,25,3],[30,3,31,3],[22,2,23,2],[24,2,25,2],[26,2,27,2],[26,12,27,12],[28,12,29,12],[30,12,31,12],[32,12,33,12],[34,12,35,12],[22,8,23,8],[24,8,25,8],[46,14,46,17],[39,2,39,17],[22,4,23,5],[24,4,25,5],[26,4,27,5],[28,4,29,5],[30,4,31,5],[41,5,41,6],[42,5,42,6],[43,5,43,6],[26,3,27,3],[28,2,29,2],[28,3,29,3],[30,2,31,2],[32,2,33,2],[32,3,33,3],[34,2,35,2],[34,3,35,3],[34,4,35,5],[34,8,35,8],[30,7,31,7],[26,10,27,10],[28,11,29,11],[28,13,29,13],[28,15,29,15],[28,17,29,17],[26,8,27,8],[28,8,29,8],[30,8,31,8],[32,8,33,8]]}
["HOME",null,"SolutionWise - Create a Solution"]
[]
["NEXT",null,"1. State the Purpose",null,{"$f":"IF('SolutionWise Req''s'!C4<>\"\",'SolutionWise Req''s'!C4,\"\")","v":"Select an MDM vendor for Verizon EMM product"}]
["BACK"]
[null,null,"3. Generating and Evaluating Alternatives",null,"Alternative #1",null,"√","Alternative #2","√","Alternative #3","√","Alternative #4","√","Alternative #5","√","Alternative #6","√","Alternative #7","√","Alternative #8","√"]
[null,null,null,null,1,null,null,2,null,3,null,4,null,5,null,6,null,7,null,8]
[null,null,1,{"$f":"IF('SolutionWise Req''s'!K6>0,'SolutionWise Req''s'!K6,\"\")","v":"Proactive enrollment process - not user prompted"},null,null,null,null,null," ",null,null,null," ",null,null,null," "]
[]
[null,null,2,{"$f":"IF('SolutionWise Req''s'!K8>0,'SolutionWise Req''s'!K8,\"\")","v":"Strong existing customer base"},null,null,null,null,null," ",null,null,null," ",null,null,null," "]
[]
[null,null,3,{"$f":"IF('SolutionWise Req''s'!K10>0,'SolutionWise Req''s'!K10,\"\")","v":"Supports IOS, Android, Windows, and Windows Phone devices"},null,null,null,null,null," ",null,null,null," ",null,null,null," "]
[]
[null,null,4,{"$f":"IF('SolutionWise Req''s'!K12>0,'SolutionWise Req''s'!K12,\"\")","v":"Service can be run in the Cloud by Verizon"},null,null,null,null,null," ",null,null,null," ",null,null,null," "]
[]
[null,null,5,{"$f":"IF('SolutionWise Req''s'!K14>0,'SolutionWise Req''s'!K14,\"\")","v":"Licenses are less than $5 per month per user and are tiered by # of licenses"},null,null,null,null,null," ",null,null,null," ",null,null,null," "]
{"$rows_left_out":39}
{"sheet":"Making a Choice","index":5,"n_rows":60,"n_cols":30,"rows_kept":60,"cut":false,"hidden":false,"merged":[[59,4,60,8],[41,9,42,9],[41,11,42,11],[41,12,42,12],[41,14,42,14],[41,15,42,15],[41,6,42,6],[57,3,57,5],[58,3,58,5],[57,7,57,8],[58,7,58,8],[47,2,47,18],[55,15,55,18],[56,15,56,18],[48,3,48,5],[49,3,49,5],[50,3,50,5],[51,3,51,5],[52,3,52,5],[53,3,53,5],[54,3,54,5],[55,3,55,5],[56,3,56,5],[57,9,57,11],[58,9,58,11],[41,24,42,24],[41,26,42,26],[41,27,42,27],[41,29,42,29],[41,17,42,17],[41,18,42,18],[41,20,42,20],[41,21,42,21],[41,23,42,23],[48,9,48,11],[49,9,49,11],[50,9,50,11],[51,9,51,11],[52,9,52,11],[53,9,53,11],[54,9,54,11],[55,9,55,11],[56,9,56,11],[37,27,38,27],[37,29,38,29],[39,9,40,9],[39,11,40,11],[39,12,40,12],[39,14,40,14],[39,15,40,15],[39,17,40,17],[39,18,40,18],[39,20,40,20],[39,21,40,21],[39,23,40,23],[39,24,40,24],[39,26,40,26],[39,27,40,27],[39,29,40,29],[37,23,38,23],[37,24,38,24],[37,26,38,26],[35,17,36,17],[35,18,36,18],[35,20,36,20],[35,21,36,21],[35,23,36,23],[35,9,36,9],[35,11,36,11],[35,12,36,12],[37,9,38,9],[37,11,38,11],[37,12,38,12],[37,14,38,14],[37,15,38,15],[37,17,38,17],[37,18,38,18],[37,20,38,20],[37,21,38,21],[35,14,36,14],[35,15,36,15],[29,27,30,27],[29,29,30,29],[31,27,32,27],[31,29,32,29],[33,9,34,9],[33,11,34,11],[33,12,34,12],[33,14,34,14],[33,15,34,15],[33,17,34,17],[33,18,34,18],[33,20,34,20],[33,21,34,21],[33,23,34,23],[33,24,34,24],[33,26,34,26],[33,27,34,27],[33,29,34,29],[31,26,32,26],[29,17,30,17],[29,18,30,18],[29,20,30,20],[29,21,30,21],[29,23,30,23],[31,18,32,18],[31,20,32,20],[31,21,32,21],[29,24,30,24],[29,26,30,26],[29,9,30,9],[29,11,30,11],[29,12,30,12],[31,9,32,9],[31,11,32,11],[31,12,32,12],[31,14,32,14],[31,15,32,15],[31,17,32,17],[29,14,30,14],[29,15,30,15],[27,23,28,23],[27,24,28,24],[27,26,28,26],[27,27,28,27],[27,29,28,29],[25,23,26,23],[25,24,26,24],[25,26,26,26],[25,9,26,9],[25,11,26,11],[25,12,26,12],[25,14,26,14],[25,15,26,15],[27,9,28,9],[27,11,28,11],[27,12,28,12],[27,14,28,14],[27,15,28,15],[27,17,28,17],[27,18,28,18],[27,20,28,20],[27,21,28,21],[25,17,26,17],[25,18,26,18],[25,20,26,20],[25,21,26,21],[21,27,22,27],[21,29,22,29],[23,17,24,17],[23,18,24,18],[23,20,24,20],[23,21,24,21],[23,23,24,23],[21,17,22,17],[21,18,22,18],[21,20,22,20],[21,21,22,21],[23,24,24,24],[23,26,24,26],[23,27,24,27],[23,29,24,29],[25,27,26,27],[25,29,26,29],[17,21,18,21],[17,23,18,23],[19,18,20,18],[19,20,20,20],[19,21,20,21],[17,24,18,24],[17,26,18,26],[23,9,24,9],[23,11,24,11],[23,12,24,12],[23,14,24,14],[23,15,24,15],[21,9,22,9],[21,11,22,11],[21,12,22,12],[21,14,22,14],[21,15,22,15],[17,27,18,27],[17,29,18,29],[19,27,20,27],[19,29,20,29],[21,23,22,23],[21,24,22,24],[21,26,22,26],[17,9,18,9],[17,11,18,11],[17,12,18,12],[19,9,20,9],[19,11,20,11],[19,12,20,12],[19,14,20,14],[19,15,20,15],[19,17,20,17],[17,14,18,14],[17,15,18,15],[19,23,20,23],[19,24,20,24],[19,26,20,26],[17,17,18,17],[17,18,18,18],[17,20,18,20],[13,27,14,27],[13,29,14,29],[15,9,16,9],[15,11,16,11],[15,12,16,12],[15,14,16,14],[15,15,16,15],[15,17,16,17],[15,18,16,18],[15,20,16,20],[15,21,16,21],[15,23,16,23],[15,24,16,24],[15,26,16,26],[15,27,16,27],[15,29,16,29],[13,23,14,23],[13,24,14,24],[13,26,14,26],[11,17,12,17],[11,18,12,18],[11,20,12,20],[11,21,12,21],[11,23,12,23],[11,9,12,9],[11,11,12,11],[11,12,12,12],[13,9,14,9],[13,11,14,11],[13,12,14,12],[13,14,14,14],[13,15,14,15],[13,17,14,17],[13,18,14,18],[13,20,14,20],[13,21,14,21],[11,14,12,14],[11,15,12,15],[7,29,8,29],[9,9,10,9],[9,11,10,11],[9,12,10,12],[9,14,10,14],[9,15,10,15],[9,17,10,17],[9,18,10,18],[9,20,10,20],[9,21,10,21],[9,23,10,23],[9,24,10,24],[9,26,10,26],[9,27,10,27],[9,29,10,29],[11,24,12,24],[11,26,12,26],[11,27,12,27],[11,29,12,29],[4,21,5,23],[4,24,5,26],[4,27,5,29],[7,9,8,9],[7,11,8,11],[7,12,8,12],[7,14,8,14],[7,15,8,15],[7,17,8,17],[7,18,8,18],[7,20,8,20],[7,21,8,21],[7,23,8,23],[7,24,8,24],[7,26,8,26],[7,27,8,27],[4,9,5,11],[4,12,5,14],[4,15,5,17],[4,18,5,20],[11,4,12,4],[11,6,12,6],[11,8,12,8],[21,4,22,4],[21,6,22,6],[21,8,22,8],[23,4,24,4],[23,6,24,6],[23,8,24,8],[17,4,18,4],[17,6,18,6],[17,8,18,8],[19,4,20,4],[19,6,20,6],[19,8,20,8],[13,4,14,4],[13,6,14,6],[13,8,14,8],[15,4,16,4],[15,6,16,6],[15,8,16,8],[11,5,12,5],[13,5,14,5],[15,5,16,5],[29,4,30,4],[29,6,30,6],[29,8,30,8],[25,4,26,4],[25,6,26,6],[25,8,26,8],[27,4,28,4],[27,6,28,6],[27,8,28,8],[25,5,26,5],[27,5,28,5],[29,5,30,5],[0,2,0,14],[2,4,2,12],[4,2,4,3],[2,2,2,3],[4,6,5,8],[7,2,8,2],[7,3,8,3],[9,2,10,2],[9,3,10,3],[7,4,8,4],[7,6,8,6],[7,8,8,8],[9,4,10,4],[9,6,10,6],[9,8,10,8],[7,5,8,5],[9,5,10,5],[11,2,12,2],[11,3,12,3],[13,2,14,2],[13,3,14,3],[15,2,16,2],[15,3,16,3],[17,2,18,2],[17,3,18,3],[19,2,20,2],[19,3,20,3],[21,2,22,2],[21,3,22,3],[23,2,24,2],[23,3,24,3],[25,2,26,2],[25,3,26,3],[27,2,28,2],[27,3,28,3],[29,2,30,2],[29,3,30,3],[31,4,32,4],[31,6,32,6],[31,8,32,8],[39,4,40,4],[39,6,40,6],[39,8,40,8],[41,8,42,8],[33,4,34,4],[33,6,34,6],[33,8,34,8],[35,4,36,4],[35,6,36,6],[35,8,36,8],[31,5,32,5],[33,5,34,5],[35,5,36,5],[37,5,38,5],[39,5,40,5],[41,5,42,5],[31,2,32,2],[31,3,32,3],[33,2,34,2],[33,3,34,3],[35,2,36,2],[35,3,36,3],[46,30,46,31],[37,2,38,2],[37,3,38,3],[39,2,40,2],[39,3,40,3],[41,2,42,2],[41,3,42,3],[46,2,46,29],[37,4,38,4],[37,6,38,6],[37,8,38,8],[41,4,42,4],[35,24,36,24],[35,26,36,26],[35,27,36,27],[35,29,36,29],[31,23,32,23],[31,24,32,24],[17,5,18,5],[19,5,20,5],[21,5,22,5],[23,5,24,5],[57,15,57,18],[58,15,58,18],[48,12,48,14],[49,12,49,14],[50,12,50,14],[51,12,51,14],[52,12,52,14],[53,12,53,14],[54,12,54,14],[55,12,55,14],[56,12,56,14],[57,12,57,14],[58,12,58,14],[48,15,48,18],[49,15,49,18],[50,15,50,18],[51,15,51,18],[52,15,52,18],[53,15,53,18],[54,15,54,18],[48,7,48,8],[49,7,49,8],[50,7,50,8],[51,7,51,8],[52,7,52,8],[53,7,53,8],[54,7,54,8],[55,7,55,8],[56,7,56,8]]}
["HOME",null,"SolutionWise - Making a Choice"]
[]
["NEXT",null,"1. State the Purpose",null,{"$f":"IF('SolutionWise Req''s'!C4<>\"\",'SolutionWise Req''s'!C4,\"\")","v":"Select an MDM vendor for Verizon EMM product"}]
["BACK"]
[null,null,"3. Generating and Evaluating Alternatives",null,null,null,"Verizon MDM",null,null,"Airwatch/VmWare",null,null,"MobileIron",null,null,"Alternative 4",null,null,"Alternative 5",null,null,"Alternative 6",null,null,"Alternative 7",null,null,"Alternative 8"]
[]
[null,null,null,null,"Min. Req.","Weight (1-10)","Information","Score (1-10)","Weight x Score","Information","Score (1-10)","Weight x Score","Information","Score (1-10)","Weight x Score","Information","Score (1-10)","Weight x Score","Information","Score (1-10)","Weight x Score","Information","Score (1-10)","Weight x Score","Information","Score (1-10)","Weight x Score","Information","Score (1-10)","Weight x Score"]
[null,null,1,{"$f":"IF('SolutionWise Req''s'!K6>0,'SolutionWise Req''s'!K6,\"\")","v":"Proactive enrollment process - not user prompted"},"Min. Req.",10,"Yes via SMS message after bulk uploading in portal","YES",100,"Yes after bulk uploading in portal","YES",100,"Yes after bulk uploading in portal","YES",{"$f":"IF(F8<>\"\",IF(N9<>\"\",F8*N9,\"\"),\"\")","v":100},null,null,{"$f":"IF(F8<>\"\",IF(Q9<>\"\",F8*Q9,\"\"),\"\")","v":""},null,null,{"$f":"IF(F8<>\"\",IF(T9<>\"\",F8*T9,\"\"),\"\")","v":""},null,null,{"$f":"IF(F8<>\"\",IF(W9<>\"\",F8*W9,\"\"),\"\")","v":""},null,null,{"$f":"IF(F8<>\"\",IF(Z9<>\"\",F8*Z9,\"\"),\"\")","v":""},null,null,{"$f":"IF(F8<>\"\",IF(AC9<>\"\",F8*AC9,\"\"),\"\")","v":""}]
[null,null,null,null,null,null,null,10,null,null,10,null,null,10]
[null,null,2,{"$f":"IF('SolutionWise Req''s'!K8>0,'SolutionWise Req''s'!K8,\"\")","v":"Strong existing customer base"},null,8,"Yes however several are Windows laptop control only.  Lower wireless device counts","YES",56,"Yes   ","YES",80,"Yes   ","YES",{"$f":"IF(F10<>\"\",IF(N11<>\"\",F10*N11,\"\"),\"\")","v":80},null,null,{"$f":"IF(F10<>\"\",IF(Q11<>\"\",F10*Q11,\"\"),\"\")","v":""},null,null,{"$f":"IF(F10<>\"\",IF(T11<>\"\",F10*T11,\"\"),\"\")","v":""},null,null,{"$f":"IF(F10<>\"\",IF(W11<>\"\",F10*W11,\"\"),\"\")","v":""},null,null,{"$f":"IF(F10<>\"\",IF(Z11<>\"\",F10*Z11,\"\"),\"\")","v":""},null,null,{"$f":"IF(F10<>\"\",IF(AC11<>\"\",F10*AC11,\"\"),\"\")","v":""}]
[null,null,null,null,null,null,null,7,null,null,10,null,null,10]
[null,null,3,{"$f":"IF('SolutionWise Req''s'!K10>0,'SolutionWise Req''s'!K10,\"\")","v":"Supports IOS, Android, Windows, and Windows Phone devices"},"Min. Req.",10,"all supported","YES",100,"All supported but Windows control not strong","YES",80,"All supported but Windows control not strong","YES",{"$f":"IF(F12<>\"\",IF(N13<>\"\",F12*N13,\"\"),\"\")","v":80},null,null,{"$f":"IF(F12<>\"\",IF(Q13<>\"\",F12*Q13,\"\"),\"\")","v":""},null,null,{"$f":"IF(F12<>\"\",IF(T13<>\"\",F12*T13,\"\"),\"\")","v":""},null,null,{"$f":"IF(F12<>\"\",IF(W13<>\"\",F12*W13,\"\"),\"\")","v":""},null,null,{"$f":"IF(F12<>\"\",IF(Z13<>\"\",F12*Z13,\"\"),\"\")","v":""},null,null,{"$f":"IF(F12<>\"\",IF(AC13<>\"\",F12*AC13,\"\"),\"\")","v":""}]
[null,null,null,null,null,null,null,10,null,null,8,null,null,8]
[null,null,4,{"$f":"IF('SolutionWise Req''s'!K12>0,'SolutionWise Req''s'!K12,\"\")","v":"Service can be run in the Cloud by Verizon"},"Min. Req.",10,"Yes currently does","YES",100,"Yes currently does","YES",100,"Yes but vendor not willing as we will compete with their cloud offering","NO",{"$f":"IF(F14<>\"\",IF(N15<>\"\",F14*N15,\"\"),\"\")","v":""},null,null,{"$f":"IF(F14<>\"\",IF(Q15<>\"\",F14*Q15,\"\"),\"\")","v":""},null,null,{"$f":"IF(F14<>\"\",IF(T15<>\"\",F14*T15,\"\"),\"\")","v":""},null,null,{"$f":"IF(F14<>\"\",IF(W15<>\"\",F14*W15,\"\"),\"\")","v":""},null,null,{"$f":"IF(F14<>\"\",IF(Z15<>\"\",F14*Z15,\"\"),\"\")","v":""},null,null,{"$f":"IF(F14<>\"\",IF(AC15<>\"\",F14*AC15,\"\"),\"\")","v":""}]
[null,null,null,null,null,null,null,10,null,null,10]
{"$rows_left_out":45}